BDBM50220295 (R)-1-((2R,6S)-1-(4-chlorophenylsulfonyl)-6-cyclopropylpiperidin-2-yl)cyclopropyl 3-hydroxypyrrolidine-1-carboxylate::CHEMBL398395
SMILES O[C@@H]1CCN(C1)C(=O)OC1(CC1)[C@H]1CCC[C@@H](C2CC2)N1S(=O)(=O)c1ccc(Cl)cc1
InChI Key InChIKey=YMXKFIYDXIGFHP-YZGWKJHDSA-N
Data  1 IC50
  Tab Delimited (TSV)   2D SDfile   Computed 3D by Vconf -m prep SDfile
Find this compound or compounds like it in BindingDB:
Activity Spreadsheet -- Enzyme Inhibition Constant Data from BindingDB
Found 1 hit for monomerid = 50220295
TargetAmyloid-beta precursor protein(Homo sapiens (Human))
Schering-Plough Research Institute
Curated by ChEMBL
LigandPNGBDBM50220295((R)-1-((2R,6S)-1-(4-chlorophenylsulfonyl)-6-cyclop...)
Affinity DataIC50:  46nM. Assay description: Inhibition of gamma-secretase assessed as reduction of membrane Abeta40 level
In DepthDetails ArticlePubMed