BDBM50220382 4'-methyl-3-trifluoromethyl-biphenyl-4-carbonitrile::CHEMBL392827
SMILES Cc1ccc(cc1)-c1ccc(C#N)c(c1)C(F)(F)F
InChI Key InChIKey=BPHIPLAMILSSMH-UHFFFAOYSA-N
Data  2 IC50
  Tab Delimited (TSV)   2D SDfile   Computed 3D by Vconf -m prep SDfile
Find this compound or compounds like it in BindingDB:
Activity Spreadsheet -- Enzyme Inhibition Constant Data from BindingDB
Found 2 hits for monomerid = 50220382
TargetAndrogen receptor(Homo sapiens (Human))
Pfizer
Curated by ChEMBL
LigandPNGBDBM50220382(4'-methyl-3-trifluoromethyl-biphenyl-4-carbonitril...)
Affinity DataIC50:  200nM. Assay description: Displacement of [3H]-DHT from human recombinant AR expressed in Sf9 cells
In DepthDetails ArticlePubMed
TargetAndrogen receptor(Homo sapiens (Human))
Pfizer
Curated by ChEMBL
LigandPNGBDBM50220382(4'-methyl-3-trifluoromethyl-biphenyl-4-carbonitril...)
Affinity DataIC50:  843nM. Assay description: Antagonist activity at human AR in MDA-MB453-MMTV-luci cells by functional assay
In DepthDetails ArticlePubMed