BDBM50220603 4-hydroxy-N-(((1s,4s)-4-(phenoxymethyl)cyclohexyl)methyl)benzamide::CHEMBL249291
SMILES Oc1ccc(cc1)C(=O)NC[C@H]1CC[C@@H](COc2ccccc2)CC1
InChI Key InChIKey=YLWSYWRAZBXIOR-CALCHBBNSA-N
Data  1 KI
  Tab Delimited (TSV)   2D SDfile   Computed 3D by Vconf -m prep SDfile
Find this compound or compounds like it in BindingDB:
Activity Spreadsheet -- Enzyme Inhibition Constant Data from BindingDB
Found 1 hit for monomerid = 50220603
TargetGlutamate receptor ionotropic, NMDA 2B(Rattus norvegicus (Rat))
Pfizer
Curated by ChEMBL
LigandPNGBDBM50220603(4-hydroxy-N-(((1s,4s)-4-(phenoxymethyl)cyclohexyl)...)
Affinity DataKi:  6.80nM. Assay description: Displacement of [3H]racemic CP101606 from rat NR2B receptor in P2 membrane
In DepthDetails ArticlePubMed