BDBM50220750 CHEMBL55695
SMILES Cc1c[nH]c(=O)n(CCCCN2CCN(CC2)c2ccc(F)cc2OCC(F)(F)F)c1=O
InChI Key InChIKey=DYZCPAWLFLCJHL-UHFFFAOYSA-N
Data  2 KI
  Tab Delimited (TSV)   2D SDfile   Computed 3D by Vconf -m prep SDfile
Find this compound or compounds like it in BindingDB:
Activity Spreadsheet -- Enzyme Inhibition Constant Data from BindingDB
Found 2 hits for monomerid = 50220750
TargetAlpha-1A adrenergic receptor(Homo sapiens (Human))
Roche Bioscience
Curated by ChEMBL
LigandPNGBDBM50220750(CHEMBL55695)
Affinity DataKi:  0.158nM. Assay description: Inhibition of [3H]prazosin binding to CHO-K1 whole cells expressing human cloned Alpha-1A adrenergic receptor
In DepthDetails ArticlePubMed
TargetAlpha-1B adrenergic receptor(Homo sapiens (Human))
Roche Bioscience
Curated by ChEMBL
LigandPNGBDBM50220750(CHEMBL55695)
Affinity DataKi:  10nM. Assay description: Inhibition of [3H]prazosin binding to CHO-K1 whole cells expressing human cloned Alpha-1B adrenergic receptor
In DepthDetails ArticlePubMed