BDBM50220781 CHEMBL55645
SMILES OCc1c[nH]c(=O)n(CCCN2CCN(CC2)c2ccc(F)cc2OCC(F)(F)F)c1=O
InChI Key InChIKey=SDHKUGRGWQZRIK-UHFFFAOYSA-N
Data  3 KI
  Tab Delimited (TSV)   2D SDfile   Computed 3D by Vconf -m prep SDfile
Find this compound or compounds like it in BindingDB:
Activity Spreadsheet -- Enzyme Inhibition Constant Data from BindingDB
Found 3 hits for monomerid = 50220781
TargetAlpha-1A adrenergic receptor(Homo sapiens (Human))
Roche Bioscience
Curated by ChEMBL
LigandPNGBDBM50220781(CHEMBL55645)
Affinity DataKi:  7.90nM. Assay description: Inhibition of [3H]prazosin binding to CHO-K1 whole cells expressing human cloned Alpha-1A adrenergic receptor
In DepthDetails ArticlePubMed
TargetAlpha-1D adrenergic receptor(Homo sapiens (Human))
Roche Bioscience
Curated by ChEMBL
LigandPNGBDBM50220781(CHEMBL55645)
Affinity DataKi:  63nM. Assay description: Inhibition of [3H]prazosin binding to CHO-K1 whole cells expressing human cloned Alpha-1D adrenergic receptor
In DepthDetails ArticlePubMed
TargetAlpha-1B adrenergic receptor(Homo sapiens (Human))
Roche Bioscience
Curated by ChEMBL
LigandPNGBDBM50220781(CHEMBL55645)
Affinity DataKi:  158nM. Assay description: Inhibition of [3H]prazosin binding to CHO-K1 whole cells expressing human cloned Alpha-1B adrenergic receptor
In DepthDetails ArticlePubMed