BDBM50221226 6-fluoro-3-(1-(3-(5-(methylsulfonyl)-3-(4-(trifluoromethyl)phenyl)-4,5,6,7-tetrahydropyrazolo[4,3-c]pyridin-1-yl)propyl)piperidin-4-yl)benzo[b]thiophene-2-carboxylic acid::CHEMBL236908
SMILES CS(=O)(=O)N1CCc2c(C1)c(nn2CCCN1CCC(CC1)c1c(sc2cc(F)ccc12)C(O)=O)-c1ccc(cc1)C(F)(F)F
InChI Key InChIKey=CFZCFOFWXVKOIN-UHFFFAOYSA-N
Data  2 IC50
  Tab Delimited (TSV)   2D SDfile   Computed 3D by Vconf -m prep SDfile
Find this compound or compounds like it in BindingDB:
Activity Spreadsheet -- Enzyme Inhibition Constant Data from BindingDB
Found 2 hits for monomerid = 50221226
TargetCathepsin S(Homo sapiens (Human))
Johnson & Johnson Pharmaceutical Research & Development
Curated by ChEMBL
LigandPNGBDBM50221226(6-fluoro-3-(1-(3-(5-(methylsulfonyl)-3-(4-(trifluo...)
Affinity DataIC50: >1.00E+4nM. Assay description: Inhibition of cathepsin S in human JY cells by invariant chain degradation assay
In DepthDetails ArticlePubMed
TargetCathepsin S(Homo sapiens (Human))
Johnson & Johnson Pharmaceutical Research & Development
Curated by ChEMBL
LigandPNGBDBM50221226(6-fluoro-3-(1-(3-(5-(methylsulfonyl)-3-(4-(trifluo...)
Affinity DataIC50:  100nM. Assay description: Inhibition of human cathepsin S
In DepthDetails ArticlePubMed