BDBM50221235 6-fluoro-N,N-dimethyl-3-(1-(3-(5-(methylsulfonyl)-3-(4-(trifluoromethyl)phenyl)-4,5,6,7-tetrahydropyrazolo[4,3-c]pyridin-1-yl)propyl)piperidin-4-yl)benzo[b]thiophene-2-carboxamide::CHEMBL395126
SMILES CN(C)C(=O)c1sc2cc(F)ccc2c1C1CCN(CCCn2nc(c3CN(CCc23)S(C)(=O)=O)-c2ccc(cc2)C(F)(F)F)CC1
InChI Key InChIKey=ATWCYIQKPYHJFE-UHFFFAOYSA-N
Data  1 IC50
  Tab Delimited (TSV)   2D SDfile   Computed 3D by Vconf -m prep SDfile
Find this compound or compounds like it in BindingDB:
Activity Spreadsheet -- Enzyme Inhibition Constant Data from BindingDB
Found 1 hit for monomerid = 50221235
TargetCathepsin S(Homo sapiens (Human))
Johnson & Johnson Pharmaceutical Research & Development
Curated by ChEMBL
LigandPNGBDBM50221235(6-fluoro-N,N-dimethyl-3-(1-(3-(5-(methylsulfonyl)-...)
Affinity DataIC50:  370nM. Assay description: Inhibition of human cathepsin S
In DepthDetails ArticlePubMed