BDBM50221259 4-(4,5-dihydro-5-thioxo-1,3,4-thiadiazol-2-yl)-1-[alpha-(4-methoxy phenyl)methylene]semicarbazide::CHEMBL235236
SMILES COc1ccc(C=NNC(=O)Nc2nnc(S)s2)cc1
InChI Key InChIKey=IWXYMJYWMSFUPE-UHFFFAOYSA-N
Data  3 KI
  Tab Delimited (TSV)   2D SDfile   Computed 3D by Vconf -m prep SDfile
Find this compound or compounds like it in BindingDB:
Activity Spreadsheet -- Enzyme Inhibition Constant Data from BindingDB
Found 3 hits for monomerid = 50221259
TargetCarbonic anhydrase 9(Homo sapiens (Human))
Assiut University
Curated by ChEMBL
LigandPNGBDBM50221259(4-(4,5-dihydro-5-thioxo-1,3,4-thiadiazol-2-yl)-1-[...)
Affinity DataKi:  2.40E+4nM. Assay description: Inhibition of catalytic domain of human cloned carbonic anhydrase9 by CO2 hydration method
In DepthDetails ArticlePubMed
TargetCarbonic anhydrase 1(Homo sapiens (Human))
Assiut University
Curated by ChEMBL
LigandPNGBDBM50221259(4-(4,5-dihydro-5-thioxo-1,3,4-thiadiazol-2-yl)-1-[...)
Affinity DataKi:  2.62E+4nM. Assay description: Inhibition of human cloned carbonic anhydrase1 by CO2 hydration method
In DepthDetails ArticlePubMed
TargetCarbonic anhydrase 2(Homo sapiens (Human))
Assiut University
Curated by ChEMBL
LigandPNGBDBM50221259(4-(4,5-dihydro-5-thioxo-1,3,4-thiadiazol-2-yl)-1-[...)
Affinity DataKi:  3.50E+5nM. Assay description: Inhibition of human cloned carbonic anhydrase2 by CO2 hydration method
In DepthDetails ArticlePubMed