BDBM50221312 CHEMBL394964::N-butyloxycarbonyl-3-[4-(2-thiazolidine-3-yl-2-oxo-ethyl)-phenyl]-5-iso-butylthiophene-2-sulfonamide
SMILES CCCCOC(=O)NS(=O)(=O)c1sc(CC(C)C)cc1-c1ccc(CC(=O)N2CCSC2)cc1
InChI Key InChIKey=TULVVAWGYAWAQW-UHFFFAOYSA-N
Data  1 KI
  Tab Delimited (TSV)   2D SDfile   Computed 3D by Vconf -m prep SDfile
Find this compound or compounds like it in BindingDB:
Activity Spreadsheet -- Enzyme Inhibition Constant Data from BindingDB
Found 1 hit for monomerid = 50221312
TargetType-1 angiotensin II receptor A(RAT)
Uppsala University
Curated by ChEMBL
LigandPNGBDBM50221312(CHEMBL394964 | N-butyloxycarbonyl-3-[4-(2-thiazoli...)
Affinity DataKi: >1.00E+4nM. Assay description: Displacement of [125I]Ang 2 from AT1 receptor in rat liver membranes
In DepthDetails ArticlePubMed