BDBM50221319 CHEMBL247079::N-butyloxycarbonyl-3-[4-(N-hexylcarbamoylmethyl)phenyl]-5-iso-butylthiophene-2-sulfonamide
SMILES CCCCCCNC(=O)Cc1ccc(cc1)-c1cc(CC(C)C)sc1S(=O)(=O)NC(=O)OCCCC
InChI Key InChIKey=DNLSNUBPIKUTGS-UHFFFAOYSA-N
Data  1 KI
  Tab Delimited (TSV)   2D SDfile   Computed 3D by Vconf -m prep SDfile
Find this compound or compounds like it in BindingDB:
Activity Spreadsheet -- Enzyme Inhibition Constant Data from BindingDB
Found 1 hit for monomerid = 50221319
TargetType-1 angiotensin II receptor A(RAT)
Uppsala University
Curated by ChEMBL
LigandPNGBDBM50221319(CHEMBL247079 | N-butyloxycarbonyl-3-[4-(N-hexylcar...)
Affinity DataKi: >1.00E+4nM. Assay description: Displacement of [125I]Ang 2 from AT1 receptor in rat liver membranes
In DepthDetails ArticlePubMed