BDBM50221432 3-(4-methyl-piperidin-1-yl)-10,10-dioxo-10H-10lambda*6*-thioxanthen-9-one::CHEMBL400100
SMILES CC1CCN(CC1)c1ccc2C(=O)c3ccccc3S(=O)(=O)c2c1
InChI Key InChIKey=JETQDUBHADSBQE-UHFFFAOYSA-N
Data  1 KI
  Tab Delimited (TSV)   2D SDfile   Computed 3D by Vconf -m prep SDfile
Find this compound or compounds like it in BindingDB:
Activity Spreadsheet -- Enzyme Inhibition Constant Data from BindingDB
Found 1 hit for monomerid = 50221432
TargetBreast cancer type 1 susceptibility protein(Homo sapiens (Human))
University Of Texas Medical Branch
Curated by ChEMBL
LigandPNGBDBM50221432(3-(4-methyl-piperidin-1-yl)-10,10-dioxo-10H-10lamb...)
Affinity DataKi:  3.90E+4nM. Assay description: Inhibition of BRCA1 assessed as BRCT-BACH1 interaction
In DepthDetails ArticlePubMed