BDBM50221676 CHEMBL239733::N-(5-(4-(2,3-dichlorophenyl)piperazin-1-yl)pentyl)-3-ethynylbenzamide
SMILES Clc1cccc(N2CCN(CCCCCNC(=O)c3cccc(c3)C#C)CC2)c1Cl
InChI Key InChIKey=BHVASJSYMURYLK-UHFFFAOYSA-N
Data  4 KI
  Tab Delimited (TSV)   2D SDfile   Computed 3D by Vconf -m prep SDfile
Find this compound or compounds like it in BindingDB:
Activity Spreadsheet -- Enzyme Inhibition Constant Data from BindingDB
Found 4 hits for monomerid = 50221676
TargetD(3) dopamine receptor(Homo sapiens (Human))
Friedrich-Alexander University
Curated by ChEMBL
LigandPNGBDBM50221676(CHEMBL239733 | N-(5-(4-(2,3-dichlorophenyl)piperaz...)
Affinity DataKi:  5.60nM. Assay description: Displacement of [3H]spiperone from human cloned dopamine D3 receptor expressed in CHO cell membranes
In DepthDetails ArticlePubMed
TargetD(2) dopamine receptor(Homo sapiens (Human))
Friedrich-Alexander University
Curated by ChEMBL
LigandPNGBDBM50221676(CHEMBL239733 | N-(5-(4-(2,3-dichlorophenyl)piperaz...)
Affinity DataKi:  23nM. Assay description: Displacement of [3H]spiperone from human cloned dopamine receptor D2 short expressed in CHO cell membranes
In DepthDetails ArticlePubMed
TargetD(2) dopamine receptor(Homo sapiens (Human))
Friedrich-Alexander University
Curated by ChEMBL
LigandPNGBDBM50221676(CHEMBL239733 | N-(5-(4-(2,3-dichlorophenyl)piperaz...)
Affinity DataKi:  51nM. Assay description: Displacement of [3H]spiperone from human cloned dopamine receptor D2 long expressed in CHO cell membranes
In DepthDetails ArticlePubMed
TargetD(1A) dopamine receptor(Sus scrofa)
Friedrich-Alexander University
Curated by ChEMBL
LigandPNGBDBM50221676(CHEMBL239733 | N-(5-(4-(2,3-dichlorophenyl)piperaz...)
Affinity DataKi:  860nM. Assay description: Displacement of [3H]SCH 23390 from pig dopamine D1 receptor in porcine striatal membranes
In DepthDetails ArticlePubMed