BDBM50221824 (1S,2R,5S,6S,7S,8R,9R,12R)-12-(acetyloxy)-6-[(acetyloxy)methyl]-5,8-bis(benzoyloxy)-2-hydroxy-2,10,10-trimethyl-11-oxatricyclo[7.2.1.0^{1,6}]dodecan-7-yl benzoate::CHEMBL430247
SMILES CC(=O)OC[C@@]12[C@H](CC[C@@](C)(O)[C@]11OC(C)(C)[C@@H]([C@H]1OC(C)=O)[C@@H](OC(=O)c1ccccc1)[C@H]2OC(=O)c1ccccc1)OC(=O)c1ccccc1
InChI Key InChIKey=NNJSHWQUZCBWFH-OFBMIMMCSA-N
Data  1 KI
  Tab Delimited (TSV)   2D SDfile   Computed 3D by Vconf -m prep SDfile
Find this compound or compounds like it in BindingDB:
Activity Spreadsheet -- Enzyme Inhibition Constant Data from BindingDB
Found 1 hit for monomerid = 50221824
TargetATP-dependent translocase ABCB1(Homo sapiens (Human))
Instituto Universitario De Bio-Organica Antonio Gonzalez
Curated by ChEMBL
LigandPNGBDBM50221824((1S,2R,5S,6S,7S,8R,9R,12R)-12-(acetyloxy)-6-[(acet...)
Affinity DataKi:  1.22E+3nM. Assay description: Inhibition of human Pgp-mediated DNR transport in NIH3T3 cells by microplate assay
In DepthDetails ArticlePubMed