BDBM50221841 (1S,2R,4S,5R,6S,7S,8R,9R,12R)-12-(acetyloxy)-4,5,8-tris(benzoyloxy)-6-(hydroxymethyl)-2,10,10-trimethyl-11-oxatricyclo[7.2.1.0^{1,6}]dodecan-7-yl benzoate::CHEMBL266341
SMILES C[C@@H]1C[C@H](OC(=O)c2ccccc2)[C@H](OC(=O)c2ccccc2)[C@@]2(CO)[C@H](OC(=O)c3ccccc3)[C@H](OC(=O)c3ccccc3)[C@@H]3[C@@H](OC(C)=O)[C@]12OC3(C)C
InChI Key InChIKey=PEMSGZQCEDDEGL-UHPPAMLESA-N
Data  1 KI
  Tab Delimited (TSV)   2D SDfile   Computed 3D by Vconf -m prep SDfile
Find this compound or compounds like it in BindingDB:
Activity Spreadsheet -- Enzyme Inhibition Constant Data from BindingDB
Found 1 hit for monomerid = 50221841
TargetATP-dependent translocase ABCB1(Homo sapiens (Human))
Instituto Universitario De Bio-Organica Antonio Gonzalez
Curated by ChEMBL
LigandPNGBDBM50221841((1S,2R,4S,5R,6S,7S,8R,9R,12R)-12-(acetyloxy)-4,5,8...)
Affinity DataKi:  1.30E+3nM. Assay description: Inhibition of human Pgp-mediated DNR transport in NIH3T3 cells by microplate assay
In DepthDetails ArticlePubMed