BDBM50221865 (1R,2R,4R,5R,6R,7S,9R)-4-(acetyloxy)-7-(benzoyloxy)-2-hydroxy-2,6,10,10-tetramethyl-11-oxatricyclo[7.2.1.0^{1,6}]dodecan-5-yl benzoate::CHEMBL275101
SMILES CC(=O)O[C@@H]1C[C@@](C)(O)[C@@]23C[C@@H](C[C@H](OC(=O)c4ccccc4)[C@]2(C)[C@H]1OC(=O)c1ccccc1)C(C)(C)O3
InChI Key InChIKey=ZKNFRNMQEHOVJP-GHVVQXKNSA-N
Data  1 KI
  Tab Delimited (TSV)   2D SDfile   Computed 3D by Vconf -m prep SDfile
Find this compound or compounds like it in BindingDB:
Activity Spreadsheet -- Enzyme Inhibition Constant Data from BindingDB
Found 1 hit for monomerid = 50221865
TargetATP-dependent translocase ABCB1(Homo sapiens (Human))
Instituto Universitario De Bio-Organica Antonio Gonzalez
Curated by ChEMBL
LigandPNGBDBM50221865((1R,2R,4R,5R,6R,7S,9R)-4-(acetyloxy)-7-(benzoyloxy...)
Affinity DataKi:  7.59E+3nM. Assay description: Inhibition of human Pgp-mediated DNR transport in NIH3T3 cells by microplate assay
In DepthDetails ArticlePubMed