BDBM50222029 CHEMBL244484::ethyl (4aS,5S,5aS,6R,8aR,9aS)-5-[(E)-2-[5-(3-fluorophenyl)-2-pyridinyl]ethenyl]-decahydro-6-methyl-8-oxofuro[3,4-g]quinoline-1(2H)-carboxylate
SMILES CCOC(=O)N1CCC[C@@H]2[C@@H]1C[C@@H]1[C@@H]([C@@H](C)OC1=O)[C@H]2\C=C\c1ccc(cn1)-c1cccc(F)c1
InChI Key InChIKey=BFBXRAKKVQFSOB-IXOSIACLSA-N
Data  1 IC50
  Tab Delimited (TSV)   2D SDfile   Computed 3D by Vconf -m prep SDfile
Find this compound or compounds like it in BindingDB:
Activity Spreadsheet -- Enzyme Inhibition Constant Data from BindingDB
Found 1 hit for monomerid = 50222029
TargetProteinase-activated receptor 1(Homo sapiens (Human))
Schering-Plough Research Institute
Curated by ChEMBL
LigandPNGBDBM50222029(CHEMBL244484 | ethyl (4aS,5S,5aS,6R,8aR,9aS)-5-[(E...)
Affinity DataIC50:  224nM. Assay description: Displacement of [3H]haTRAP from PAR1 in human platelet membrane
In DepthDetails ArticlePubMed