BDBM50222142 (S,E)-2-amino-N-(2-(benzyloxy)-1-(1-cinnamyl-1H-tetrazol-5-yl)ethyl)-2-methylpropanamide::CHEMBL238155
SMILES CC(C)(N)C(=O)N[C@H](COCc1ccccc1)c1nnnn1C\C=C\c1ccccc1
InChI Key InChIKey=HLENXMZVAHVDRD-CBHXRGPZSA-N
Data  1 KI  1 EC50
  Tab Delimited (TSV)   2D SDfile   Computed 3D by Vconf -m prep SDfile
Find this compound or compounds like it in BindingDB:
Activity Spreadsheet -- Enzyme Inhibition Constant Data from BindingDB
Found 2 hits for monomerid = 50222142
TargetGrowth hormone secretagogue receptor type 1(Homo sapiens (Human))
Bristol-Myers Squibb Pharmaceutical Research Institute
Curated by ChEMBL
LigandPNGBDBM50222142((S,E)-2-amino-N-(2-(benzyloxy)-1-(1-cinnamyl-1H-te...)
Affinity DataKi:  190nM. Assay description: Displacement of [125I]Ghrelin from human GHSR1a after 1 hr
In DepthDetails ArticlePubMed
TargetGrowth hormone secretagogue receptor type 1(Homo sapiens (Human))
Bristol-Myers Squibb Pharmaceutical Research Institute
Curated by ChEMBL
LigandPNGBDBM50222142((S,E)-2-amino-N-(2-(benzyloxy)-1-(1-cinnamyl-1H-te...)
Affinity DataEC50:  12nM. Assay description: Agonist activity at human GHS receptor expressed in H4 glioma cells assessed as intracellular calcium concentration by FLIPR assay
In DepthDetails ArticlePubMed