BDBM50222390 CHEMBL127606
SMILES O=C(CCCCCCSc1ccc2ccccc2c1)c1ncco1
InChI Key InChIKey=VBLCYAZNRMVIST-UHFFFAOYSA-N
Data  1 IC50
  Tab Delimited (TSV)   2D SDfile   Computed 3D by Vconf -m prep SDfile
Find this compound or compounds like it in BindingDB:
Activity Spreadsheet -- Enzyme Inhibition Constant Data from BindingDB
Found 1 hit for monomerid = 50222390
TargetHistone deacetylase(Homo sapiens (Human))
Abbott Laboratories
Curated by ChEMBL
LigandPNGBDBM50222390(CHEMBL127606)
Affinity DataIC50:  540nM. Assay description: In vitro inhibition of Histone deacetylase in K 562 erythroleukemia cells.
In DepthDetails ArticlePubMed