BDBM50222495 (S)-1-(2-((4-(3-chloro-4-(pyridin-2-ylmethoxy)phenylamino)quinazolin-5-yloxy)methyl)pyrrolidin-1-yl)-2-hydroxyethanone::CHEMBL403569
SMILES OCC(=O)N1CCC[C@H]1COc1cccc2ncnc(Nc3ccc(OCc4ccccn4)c(Cl)c3)c12
InChI Key InChIKey=FSHWIHXFSFIOAL-FQEVSTJZSA-N
Data  3 IC50
  Tab Delimited (TSV)   2D SDfile   Computed 3D by Vconf -m prep SDfile
Find this compound or compounds like it in BindingDB:
Activity Spreadsheet -- Enzyme Inhibition Constant Data from BindingDB
Found 3 hits for monomerid = 50222495
TargetEpidermal growth factor receptor(Homo sapiens (Human))
Astrazeneca
Curated by ChEMBL
LigandPNGBDBM50222495((S)-1-(2-((4-(3-chloro-4-(pyridin-2-ylmethoxy)phen...)
Affinity DataIC50:  327nM. Assay description: Inhibition of EGFR
In DepthDetails ArticlePubMed
TargetReceptor tyrosine-protein kinase erbB-2(Homo sapiens (Human))
Astrazeneca
Curated by ChEMBL
LigandPNGBDBM50222495((S)-1-(2-((4-(3-chloro-4-(pyridin-2-ylmethoxy)phen...)
Affinity DataIC50:  2nM. Assay description: Inhibition of ErbB2 kinase
In DepthDetails ArticlePubMed
TargetReceptor tyrosine-protein kinase erbB-2(Homo sapiens (Human))
Astrazeneca
Curated by ChEMBL
LigandPNGBDBM50222495((S)-1-(2-((4-(3-chloro-4-(pyridin-2-ylmethoxy)phen...)
Affinity DataIC50:  259nM. Assay description: Inhibition of Erb2 autophosphorylation by cellular clone 24 assay
In DepthDetails ArticlePubMed