BDBM50222691 CHEMBL156927
SMILES CC(C)N(CCCc1ccc(O)c(O)c1)C(\S)=N\CCc1ccccc1
InChI Key InChIKey=UQKLAYXIIKPJQV-UHFFFAOYSA-N
Data  1 IC50
  Tab Delimited (TSV)   2D SDfile   Computed 3D by Vconf -m prep SDfile
Find this compound or compounds like it in BindingDB:
Activity Spreadsheet -- Enzyme Inhibition Constant Data from BindingDB
Found 1 hit for monomerid = 50222691
TargetTransient receptor potential cation channel subfamily V member 1/2/4(Rattus norvegicus)
Seoul National University
Curated by ChEMBL
LigandPNGBDBM50222691(CHEMBL156927)
Affinity DataIC50:  9.30nM. Assay description: Antagonistic activity against vanilloid receptor as concentration to reduce the response to 0.5 mM capsaicin by 50% from neonatal rat culture spinal ...
In DepthDetails ArticlePubMed