BDBM50222695 CHEMBL155433
SMILES COc1cc(CCCN(C(c2ccccc2)c2ccccc2)C(\S)=N\CCc2ccccc2)ccc1O
InChI Key InChIKey=GPVFYTSYLLPLGP-UHFFFAOYSA-N
Data  1 IC50
  Tab Delimited (TSV)   2D SDfile   Computed 3D by Vconf -m prep SDfile
Find this compound or compounds like it in BindingDB:
Activity Spreadsheet -- Enzyme Inhibition Constant Data from BindingDB
Found 1 hit for monomerid = 50222695
TargetTransient receptor potential cation channel subfamily V member 1/2/4(Rattus norvegicus)
Seoul National University
Curated by ChEMBL
LigandPNGBDBM50222695(CHEMBL155433)
Affinity DataIC50:  0.460nM. Assay description: Antagonistic activity against vanilloid receptor as concentration to reduce the response to 0.5 mM capsaicin by 50% from neonatal rat culture spinal ...
In DepthDetails ArticlePubMed