BDBM50222768 CHEMBL19680
SMILES CCc1ccc(OC(C)C(O)CNC(C)C)cc1
InChI Key InChIKey=IPSUFEVDTFTCNZ-UHFFFAOYSA-N
Data  1 Kd
  Tab Delimited (TSV)   2D SDfile   Computed 3D by Vconf -m prep SDfile
Find this compound or compounds like it in BindingDB:
Activity Spreadsheet -- Enzyme Inhibition Constant Data from BindingDB
Found 1 hit for monomerid = 50222768
TargetBeta-1/Beta-2/Beta-3 adrenergic receptor(Rattus norvegicus (Rat))
TBA
Curated by ChEMBL
LigandPNGBDBM50222768(CHEMBL19680)
Affinity DataKd:  2.00E+3nM. Assay description: Binding affinity against Beta adrenergic receptor in C6-2B astrocytoma cells, using [125I]-iodohydroxybenzylpindolol-benzylpindolol([125I]-HYP)
In DepthDetails ArticlePubMed