BDBM50222857 6-(4-chlorophenyl)-2-(2-methylphenyl)-3-{[1-(3,3,3-trifluoropropyl)piperidin-3-yl]methyl}quinazolin-4(3H)-one::CHEMBL390648
SMILES Cc1ccccc1-c1nc2ccc(cc2c(=O)n1CC1CCCN(CCC(F)(F)F)C1)-c1ccc(Cl)cc1
InChI Key InChIKey=MNVDKXPJRHTVKG-UHFFFAOYSA-N
Data  1 KI
  Tab Delimited (TSV)   2D SDfile   Computed 3D by Vconf -m prep SDfile
Find this compound or compounds like it in BindingDB:
Activity Spreadsheet -- Enzyme Inhibition Constant Data from BindingDB
Found 1 hit for monomerid = 50222857
TargetGrowth hormone secretagogue receptor type 1(Ovis aries)
Bayer Pharmaceuticals
Curated by ChEMBL
LigandPNGBDBM50222857(6-(4-chlorophenyl)-2-(2-methylphenyl)-3-{[1-(3,3,3...)
Affinity DataKi:  250nM. Assay description: Displacement of [125I]ghrelin from ovine recombinant GHSR1a expressed in HEK293F cells after 6 hrs by scintillation proximity assay
In DepthDetails ArticlePubMed