BDBM50223026 3,6-diethyl-N2-(pentan-3-yl)-N5-(pyridin-2-yl)pyrazine-2,5-diamine::CHEMBL398842
SMILES CCC(CC)Nc1nc(CC)c(Nc2ccccn2)nc1CC
InChI Key InChIKey=HABJOEYHFWFMHS-UHFFFAOYSA-N
Data  1 KI
  Tab Delimited (TSV)   2D SDfile   Computed 3D by Vconf -m prep SDfile
Find this compound or compounds like it in BindingDB:
Activity Spreadsheet -- Enzyme Inhibition Constant Data from BindingDB
Found 1 hit for monomerid = 50223026
TargetCorticotropin-releasing factor receptor 1(Homo sapiens (Human))
Pfizer
Curated by ChEMBL
LigandPNGBDBM50223026(3,6-diethyl-N2-(pentan-3-yl)-N5-(pyridin-2-yl)pyra...)
Affinity DataKi: >1.00E+4nM. Assay description: Displacement of [125I]Tyr-o-CRF from CRF1 receptor in IMR32 cells
In DepthDetails ArticlePubMed