BDBM50223173 CHEMBL239017::N,N-dimethyl-4-[(5-methylisoxazol-3-yl)oxy]-but-2-yn-1-amine fumarate
SMILES C[NH+](C)CC#CCOc1cc(C)on1
InChI Key InChIKey=GQSCMIFRRSZUKK-UHFFFAOYSA-O
Data  5 KI  1 Kd
  Tab Delimited (TSV)   2D SDfile   Computed 3D by Vconf -m prep SDfile
Find this compound or compounds like it in BindingDB:
Activity Spreadsheet -- Enzyme Inhibition Constant Data from BindingDB
Found 6 hits for monomerid = 50223173
TargetMuscarinic acetylcholine receptor M4(Homo sapiens (Human))
Universit£
Curated by ChEMBL
LigandPNGBDBM50223173(CHEMBL239017 | N,N-dimethyl-4-[(5-methylisoxazol-3...)
Affinity DataKi:  1.10E+3nM. Assay description: Displacement of [3H]QNB from human muscarinic M4 receptor expressed in CHO cells
In DepthDetails ArticlePubMed
TargetMuscarinic acetylcholine receptor M2(Homo sapiens (Human))
Universit£
Curated by ChEMBL
LigandPNGBDBM50223173(CHEMBL239017 | N,N-dimethyl-4-[(5-methylisoxazol-3...)
Affinity DataKi:  3.80E+3nM. Assay description: Displacement of [3H]QNB from human muscarinic M2 receptor expressed in CHO cells
In DepthDetails ArticlePubMed
TargetMuscarinic acetylcholine receptor M1(Homo sapiens (Human))
Universit£
Curated by ChEMBL
LigandPNGBDBM50223173(CHEMBL239017 | N,N-dimethyl-4-[(5-methylisoxazol-3...)
Affinity DataKi: >1.00E+4nM. Assay description: Displacement of [3H]QNB from human muscarinic M1 receptor expressed in CHO cells
In DepthDetails ArticlePubMed
TargetMuscarinic acetylcholine receptor M5(Homo sapiens (Human))
Universit£
Curated by ChEMBL
LigandPNGBDBM50223173(CHEMBL239017 | N,N-dimethyl-4-[(5-methylisoxazol-3...)
Affinity DataKi: >1.00E+4nM. Assay description: Displacement of [3H]QNB from human muscarinic M5 receptor expressed in CHO cells
In DepthDetails ArticlePubMed
TargetMuscarinic acetylcholine receptor M3(Homo sapiens (Human))
Universit£
Curated by ChEMBL
LigandPNGBDBM50223173(CHEMBL239017 | N,N-dimethyl-4-[(5-methylisoxazol-3...)
Affinity DataKi: >1.00E+4nM. Assay description: Displacement of [3H]QNB from human muscarinic M3 receptor expressed in CHO cells
In DepthDetails ArticlePubMed
TargetMuscarinic acetylcholine receptor(Cavia porcellus)
Universit£
Curated by ChEMBL
LigandPNGBDBM50223173(CHEMBL239017 | N,N-dimethyl-4-[(5-methylisoxazol-3...)
Affinity DataKd:  3.98E+4nM. Assay description: Binding affinity to muscarinic M3 receptor in guinea-pig ileum
In DepthDetails ArticlePubMed