BDBM50223240 1-((2R,6R)-1-(4-chlorophenylsulfonyl)-6-methylpiperidin-2-yl)cyclopropyl 4-(1-hydroxy-2-methylpropan-2-yl)piperazine-1-carboxylate::CHEMBL249292
SMILES C[C@@H]1CCC[C@@H](N1S(=O)(=O)c1ccc(Cl)cc1)C1(CC1)OC(=O)N1CCN(CC1)C(C)(C)CO
InChI Key InChIKey=YAMNDFFLOPYHJZ-WIYYLYMNSA-N
Data  1 IC50
  Tab Delimited (TSV)   2D SDfile   Computed 3D by Vconf -m prep SDfile
Find this compound or compounds like it in BindingDB:
Activity Spreadsheet -- Enzyme Inhibition Constant Data from BindingDB
Found 1 hit for monomerid = 50223240
TargetCytochrome P450 3A4(Homo sapiens (Human))
Schering-Plough Research Institute
Curated by ChEMBL
LigandPNGBDBM50223240(1-((2R,6R)-1-(4-chlorophenylsulfonyl)-6-methylpipe...)
Affinity DataIC50:  800nM. Assay description: Inhibition of CYP3A4 after 30 mins
In DepthDetails ArticlePubMed