BDBM50223248 1-((2R,6S)-1-(4-chlorophenylsulfonyl)-6-(3,5-difluorophenyl)piperidin-2-yl)cyclopropyl 4-(1-hydroxy-2-methylpropan-2-yl)piperazine-1-carboxylate::CHEMBL249087
SMILES CC(C)(CO)N1CCN(CC1)C(=O)OC1(CC1)[C@H]1CCC[C@H](N1S(=O)(=O)c1ccc(Cl)cc1)c1cc(F)cc(F)c1
InChI Key InChIKey=OMDLVUGUASZVGG-IZZNHLLZSA-N
Data  1 IC50
  Tab Delimited (TSV)   2D SDfile   Computed 3D by Vconf -m prep SDfile
Find this compound or compounds like it in BindingDB:
Activity Spreadsheet -- Enzyme Inhibition Constant Data from BindingDB
Found 1 hit for monomerid = 50223248
TargetCytochrome P450 3A4(Homo sapiens (Human))
Schering-Plough Research Institute
Curated by ChEMBL
LigandPNGBDBM50223248(1-((2R,6S)-1-(4-chlorophenylsulfonyl)-6-(3,5-diflu...)
Affinity DataIC50:  400nM. Assay description: Inhibition of CYP3A4 after 30 mins
In DepthDetails ArticlePubMed