BDBM50223252 1-((2R,4S,6S)-1-(4-chlorophenylsulfonyl)-6-cyclopropyl-4-hydroxypiperidin-2-yl)cyclopropyl 4-(1-hydroxy-2-methylpropan-2-yl)piperazine-1-carboxylate::CHEMBL399507
SMILES CC(C)(CO)N1CCN(CC1)C(=O)OC1(CC1)[C@H]1C[C@@H](O)C[C@@H](C2CC2)N1S(=O)(=O)c1ccc(Cl)cc1
InChI Key InChIKey=SMIMGTZNUUPWTH-ACIOBRDBSA-N
Data  2 IC50
  Tab Delimited (TSV)   2D SDfile   Computed 3D by Vconf -m prep SDfile
Find this compound or compounds like it in BindingDB:
Activity Spreadsheet -- Enzyme Inhibition Constant Data from BindingDB
Found 2 hits for monomerid = 50223252
TargetCytochrome P450 3A4(Homo sapiens (Human))
Merck Research Lab.
Curated by ChEMBL
LigandPNGBDBM50223252(1-((2R,4S,6S)-1-(4-chlorophenylsulfonyl)-6-cyclopr...)
Affinity DataIC50:  1.95E+4nM. Assay description: Inhibition of CYP3A4 after 30 mins
In DepthDetails ArticlePubMed
TargetCytochrome P450 3A4(Homo sapiens (Human))
Merck Research Lab.
Curated by ChEMBL
LigandPNGBDBM50223252(1-((2R,4S,6S)-1-(4-chlorophenylsulfonyl)-6-cyclopr...)
Affinity DataIC50:  1.95E+4nM. Assay description: Inhibition of CYP3A4 after 30 mins
In DepthDetails ArticlePubMed