BDBM50223404 CHEMBL277459
SMILES CC(C)NC(C)C(O)COc1ccc(C)c(C)c1
InChI Key InChIKey=DYBVOBOVLLZZSV-UHFFFAOYSA-N
Data  2 EC50
  Tab Delimited (TSV)   2D SDfile   Computed 3D by Vconf -m prep SDfile
Find this compound or compounds like it in BindingDB:
Activity Spreadsheet -- Enzyme Inhibition Constant Data from BindingDB
Found 1 hit for monomerid = 50223404
TargetReceptor-type tyrosine-protein phosphatase beta(Homo sapiens (Human))
Ruprecht-Karls-Universit£t Heidelberg
Curated by ChEMBL
LigandPNGBDBM50223404(CHEMBL5277754)
Affinity DataIC50:  1.07E+3nM. Assay description: Inhibition of Protein farnesyltransferase (FPT)
In DepthDetails ArticlePubMed