BDBM50223439 5-{(R)-2-[(R)-2-hydroxy-2-(4-hydroxy-3-hydroxymethyl-phenyl)-ethylamino]-propyl}-1H-indole-2-carboxylic acid 4-sulfamoyl-benzylamide::CHEMBL235818
SMILES C[C@H](Cc1ccc2[nH]c(cc2c1)C(=O)NCc1ccc(cc1)S(N)(=O)=O)NC[C@H](O)c1ccc(O)c(CO)c1
InChI Key InChIKey=PRFZKEKERRWRMV-CRYYWNKWSA-N
Data  1 EC50
  Tab Delimited (TSV)   2D SDfile   Computed 3D by Vconf -m prep SDfile
Find this compound or compounds like it in BindingDB:
Activity Spreadsheet -- Enzyme Inhibition Constant Data from BindingDB
Found 1 hit for monomerid = 50223439
TargetBeta-2 adrenergic receptor(Homo sapiens (Human))
Pfizer
Curated by ChEMBL
LigandPNGBDBM50223439(5-{(R)-2-[(R)-2-hydroxy-2-(4-hydroxy-3-hydroxymeth...)
Affinity DataEC50:  0.122nM. Assay description: Agonist activity at human recombinant adrenergic beta-2 receptor expressed in CHO cells assessed as elevation in cAMP levels
In DepthDetails ArticlePubMed