BDBM50223637 Alphacemethadone::Alphacetylmethadol
SMILES CC[C@@H](OC(C)=O)C(C[C@@H](C)N(C)C)(c1ccccc1)c1ccccc1
InChI Key InChIKey=XBMIVRRWGCYBTQ-XMSQKQJNSA-N
Data  2 KI
  Tab Delimited (TSV)   2D SDfile   Computed 3D by Vconf -m prep SDfile
Find this compound or compounds like it in BindingDB:
Activity Spreadsheet -- Enzyme Inhibition Constant Data from BindingDB
Found 2 hits for monomerid = 50223637
LigandPNGBDBM50223637(Alphacemethadone | Alphacetylmethadol)
Affinity DataKi:  1.20nM. Assay description: Inhibition of [3H]- naloxone binding to Opioid receptors in rat brain membrane in the absence of Na
In DepthDetails ArticlePubMed
LigandPNGBDBM50223637(Alphacemethadone | Alphacetylmethadol)
Affinity DataKi:  3.40nM. Assay description: Compound was evaluated for the inhibition of [3H]- naloxone binding to Opioid receptors in rat brain membrane in the presence of Na
In DepthDetails ArticlePubMed