BDBM50223903 CHEMBL279101
SMILES Oc1nc(nc2ccccc12)-c1cnc2ccccc2c1
InChI Key InChIKey=TWWOVQIRBPJXFD-UHFFFAOYSA-N
Data  1 IC50
  Tab Delimited (TSV)   2D SDfile   Computed 3D by Vconf -m prep SDfile
Find this compound or compounds like it in BindingDB:
Activity Spreadsheet -- Enzyme Inhibition Constant Data from BindingDB
Found 1 hit for monomerid = 50223903
TargetDNA topoisomerase 2-alpha/2-beta(Homo sapiens (Human))
Toho University
Curated by ChEMBL
LigandPNGBDBM50223903(CHEMBL279101)
Affinity DataIC50:  2.50E+4nM. Assay description: Inhibitory activity against human DNA topoisomerase II
In DepthDetails ArticlePubMed