BDBM50223937 6-((1H-1,2,3-triazol-1-yl)methyl)-7-neopentyl-7H-pyrrolo[2,3-d]pyrimidine-2-carbonitrile::CHEMBL249757
SMILES CC(C)(C)Cn1c(Cn2ccnn2)cc2cnc(nc12)C#N
InChI Key InChIKey=JVBMXVPZGGUXPV-UHFFFAOYSA-N
Data  2 IC50
  Tab Delimited (TSV)   2D SDfile   Computed 3D by Vconf -m prep SDfile
Find this compound or compounds like it in BindingDB:
Activity Spreadsheet -- Enzyme Inhibition Constant Data from BindingDB
Found 2 hits for monomerid = 50223937
TargetCathepsin K(Homo sapiens (Human))
Novartis Institutes For Biomedical Research
Curated by ChEMBL
LigandPNGBDBM50223937(6-((1H-1,2,3-triazol-1-yl)methyl)-7-neopentyl-7H-p...)
Affinity DataIC50:  5nM. Assay description: Inhibition of cathepsin K by fluorescence assay
In DepthDetails ArticlePubMed
TargetCathepsin S(Homo sapiens (Human))
Novartis Institutes For Biomedical Research
Curated by ChEMBL
LigandPNGBDBM50223937(6-((1H-1,2,3-triazol-1-yl)methyl)-7-neopentyl-7H-p...)
Affinity DataIC50: >1.00E+3nM. Assay description: Inhibition of cathepsin S by fluorescence assay
In DepthDetails ArticlePubMed