BDBM50223993 8,8-dimethyl-3-[(3-methyl-thiophen-2-ylmethyl)-phenyl-carbamoyloxy]-8-azonia-bicyclo[3.2.1]octane; bromide::CHEMBL398590
SMILES Cc1ccsc1CN(C(=O)OC1CC2CCC(C1)[N+]2(C)C)c1ccccc1
InChI Key InChIKey=LCFLTSGKHHHXPL-UHFFFAOYSA-N
Data  3 IC50
  Tab Delimited (TSV)   2D SDfile   Computed 3D by Vconf -m prep SDfile
Find this compound or compounds like it in BindingDB:
Activity Spreadsheet -- Enzyme Inhibition Constant Data from BindingDB
Found 3 hits for monomerid = 50223993
TargetMuscarinic acetylcholine receptor M3(Homo sapiens (Human))
Glaxosmithkline
Curated by ChEMBL
LigandPNGBDBM50223993(8,8-dimethyl-3-[(3-methyl-thiophen-2-ylmethyl)-phe...)
Affinity DataIC50:  6.40nM. Assay description: Antagonist activity at cloned muscarinic M3 receptor expressed in CHO cells by measuring calcium mobilization
In DepthDetails ArticlePubMed
TargetMuscarinic acetylcholine receptor M1(Homo sapiens (Human))
Glaxosmithkline
Curated by ChEMBL
LigandPNGBDBM50223993(8,8-dimethyl-3-[(3-methyl-thiophen-2-ylmethyl)-phe...)
Affinity DataIC50:  3.80nM. Assay description: Antagonist activity at cloned muscarinic M1 receptor expressed in CHO cells by measuring calcium mobilization
In DepthDetails ArticlePubMed
TargetMuscarinic acetylcholine receptor M2(Homo sapiens (Human))
Glaxosmithkline
Curated by ChEMBL
LigandPNGBDBM50223993(8,8-dimethyl-3-[(3-methyl-thiophen-2-ylmethyl)-phe...)
Affinity DataIC50:  34.7nM. Assay description: Antagonist activity at cloned muscarinic M2 receptor expressed in CHO cells by measuring calcium mobilization
In DepthDetails ArticlePubMed