BDBM50224211 5-isopropyl-2-(isoquinolin-5-ylamino)thiazol-4(5H)-one::CHEMBL429456
SMILES CC(C)c1sc(Nc2cccc3cnccc23)nc1O
InChI Key InChIKey=FCESAIMQCOIOFC-UHFFFAOYSA-N
Data  1 KI  1 IC50
  Tab Delimited (TSV)   2D SDfile   Computed 3D by Vconf -m prep SDfile
Find this compound or compounds like it in BindingDB:
Activity Spreadsheet -- Enzyme Inhibition Constant Data from BindingDB
Found 2 hits for monomerid = 50224211
Target11-beta-hydroxysteroid dehydrogenase 1(Homo sapiens (Human))
Amgen
Curated by ChEMBL
LigandPNGBDBM50224211(5-isopropyl-2-(isoquinolin-5-ylamino)thiazol-4(5H)...)
Affinity DataKi:  32nM. Assay description: Inhibition of human 11betaHSD1 by SPA
In DepthDetails ArticlePubMed
Target11-beta-hydroxysteroid dehydrogenase 1(Homo sapiens (Human))
Amgen
Curated by ChEMBL
LigandPNGBDBM50224211(5-isopropyl-2-(isoquinolin-5-ylamino)thiazol-4(5H)...)
Affinity DataIC50:  200nM. Assay description: Inhibition of human 11betaHSD1 in CHO cells assessed as conversion of cortisone to cortisol
In DepthDetails ArticlePubMed