BDBM50224484 (1S,5R)-6-(5-bromopyridin-3-yl)-3,6-diazabicyclo[3.2.0]-heptane::CHEMBL239714
SMILES Brc1cncc(c1)N1C[C@@H]2CNC[C@H]12
InChI Key InChIKey=OGULMRQWNAMFPB-XVKPBYJWSA-N
Data  1 EC50
  Tab Delimited (TSV)   2D SDfile   Computed 3D by Vconf -m prep SDfile
Find this compound or compounds like it in BindingDB:
Activity Spreadsheet -- Enzyme Inhibition Constant Data from BindingDB
Found 1 hit for monomerid = 50224484
TargetNeuronal acetylcholine receptor subunit alpha-4/beta-2(Homo sapiens (Human))
Neuroscience Research
Curated by ChEMBL
LigandPNGBDBM50224484((1S,5R)-6-(5-bromopyridin-3-yl)-3,6-diazabicyclo[3...)
Affinity DataEC50:  1.14E+4nM. Assay description: Agonist activity at recombinant human alpha-4-beta-2 nAChR expressed in HEK293 cells assessed as induction of calcium influx by FLIPR assay
In DepthDetails ArticlePubMed