BDBM50224761 2-chloro-N6-(R)-3-tetrahydrofuranyl-9H-(2-C-methyl-5-N-benzylthiocarbamoyl-beta-D-ribofuranosyl)adenine::CHEMBL251798
SMILES C[C@@]1(O)[C@H](O)[C@@H](COC(=S)NCc2ccccc2)O[C@H]1n1cnc2c(N[C@@H]3CCOC3)nc(Cl)nc12
InChI Key InChIKey=OYNHYGRSQZDDGV-KOZJHOLOSA-N
Data  3 KI
  Tab Delimited (TSV)   2D SDfile   Computed 3D by Vconf -m prep SDfile
Find this compound or compounds like it in BindingDB:
Activity Spreadsheet -- Enzyme Inhibition Constant Data from BindingDB
Found 3 hits for monomerid = 50224761
TargetAdenosine receptor A1(BOVINE)
Universit£
Curated by ChEMBL
LigandPNGBDBM50224761(2-chloro-N6-(R)-3-tetrahydrofuranyl-9H-(2-C-methyl...)
Affinity DataKi:  230nM. Assay description: Displacement of [3H]CCPA from adenosine A1 receptor in bovine cortical membrane
In DepthDetails ArticlePubMed
TargetAdenosine receptor A1(GUINEA PIG)
Universit£
Curated by ChEMBL
LigandPNGBDBM50224761(2-chloro-N6-(R)-3-tetrahydrofuranyl-9H-(2-C-methyl...)
Affinity DataKi:  2.87E+3nM. Assay description: Displacement of [3H]CCPA from adenosine A1 receptor in pig cortical membrane
In DepthDetails ArticlePubMed
TargetAdenosine receptor A1(GUINEA PIG)
Universit£
Curated by ChEMBL
LigandPNGBDBM50224761(2-chloro-N6-(R)-3-tetrahydrofuranyl-9H-(2-C-methyl...)
Affinity DataKi:  1.41E+4nM. Assay description: Displacement of [3H]CGS21680 from adenosine A1 receptor in pig striatum membrane
In DepthDetails ArticlePubMed