BDBM50224769 2-chloro-N6-cyclopentyl-9H-(2-C-methyl-5-N-methylthiocarbamoyl-beta-D-ribofuranosyl)adenine::CHEMBL399514
SMILES CNC(=S)OC[C@H]1O[C@@H](n2cnc3c(NC4CCCC4)nc(Cl)nc23)[C@](C)(O)[C@@H]1O
InChI Key InChIKey=HRNDSWNULCAEJC-UOYMAUKRSA-N
Data  8 KI  1 EC50
  Tab Delimited (TSV)   2D SDfile   Computed 3D by Vconf -m prep SDfile
Find this compound or compounds like it in BindingDB:
Activity Spreadsheet -- Enzyme Inhibition Constant Data from BindingDB
Found 9 hits for monomerid = 50224769
TargetAdenosine receptor A1(GUINEA PIG)
Universit£
Curated by ChEMBL
LigandPNGBDBM50224769(2-chloro-N6-cyclopentyl-9H-(2-C-methyl-5-N-methylt...)
Affinity DataKi:  13nM. Assay description: Displacement of [3H]CCPA from adenosine A1 receptor in pig cortical membrane
In DepthDetails ArticlePubMed
TargetAdenosine receptor A1(BOVINE)
Universit£
Curated by ChEMBL
LigandPNGBDBM50224769(2-chloro-N6-cyclopentyl-9H-(2-C-methyl-5-N-methylt...)
Affinity DataKi:  66nM. Assay description: Displacement of [3H]CCPA from adenosine A1 receptor in bovine cortical membrane
In DepthDetails ArticlePubMed
TargetAdenosine receptor A1(Homo sapiens (Human))
Universit£
Curated by ChEMBL
LigandPNGBDBM50224769(2-chloro-N6-cyclopentyl-9H-(2-C-methyl-5-N-methylt...)
Affinity DataKi:  356nM. Assay description: Displacement of [3H]CCPA from human recombinant adenosine A1 receptor expressed in CHO cells
In DepthDetails ArticlePubMed
TargetAdenosine receptor A2b(Homo sapiens (Human))
Universit£
Curated by ChEMBL
LigandPNGBDBM50224769(2-chloro-N6-cyclopentyl-9H-(2-C-methyl-5-N-methylt...)
Affinity DataKi:  2.81E+3nM. Assay description: Agonist activity at human recombinant adenosine A2B receptor expressed in CHO cells assessed as activation of adenylyl cyclase activity
In DepthDetails ArticlePubMed
TargetAdenosine receptor A2a(Homo sapiens (Human))
Universit£
Curated by ChEMBL
LigandPNGBDBM50224769(2-chloro-N6-cyclopentyl-9H-(2-C-methyl-5-N-methylt...)
Affinity DataKi:  8.76E+3nM. Assay description: Displacement of [3H]NECA from human recombinant adenosine A2A receptor expressed in CHO cells
In DepthDetails ArticlePubMed
TargetAdenosine receptor A1(GUINEA PIG)
Universit£
Curated by ChEMBL
LigandPNGBDBM50224769(2-chloro-N6-cyclopentyl-9H-(2-C-methyl-5-N-methylt...)
Affinity DataKi:  9.20E+3nM. Assay description: Displacement of [3H]CGS21680 from adenosine A1 receptor in pig striatum membrane
In DepthDetails ArticlePubMed
TargetAdenosine receptor A1(BOVINE)
Universit£
Curated by ChEMBL
LigandPNGBDBM50224769(2-chloro-N6-cyclopentyl-9H-(2-C-methyl-5-N-methylt...)
Affinity DataKi:  1.50E+4nM. Assay description: Displacement of [3H]CGS21680 from adenosine A1 receptor in bovine striatum membrane
In DepthDetails ArticlePubMed
TargetAdenosine receptor A3(Homo sapiens (Human))
Universit£
Curated by ChEMBL
LigandPNGBDBM50224769(2-chloro-N6-cyclopentyl-9H-(2-C-methyl-5-N-methylt...)
Affinity DataKi: >1.00E+5nM. Assay description: Displacement of [3H]NECA from human recombinant adenosine A3 receptor expressed in CHO cells
In DepthDetails ArticlePubMed
TargetAdenosine receptor A1(GUINEA PIG)
Universit£
Curated by ChEMBL
LigandPNGBDBM50224769(2-chloro-N6-cyclopentyl-9H-(2-C-methyl-5-N-methylt...)
Affinity DataEC50:  326nM. Assay description: Agonist activity at adenosine A1 receptor in pig cortical membrane assessed as stimulation of GTPgammaS binding
In DepthDetails ArticlePubMed