BDBM50224782 2-chloro-N6-(R)-3-tetrahydrofuranyl-9H-(2-C-methyl-5-N-benzylcarbamoyl-beta-D-ribofuranosyl)adenine::CHEMBL254898
SMILES C[C@@]1(O)[C@H](O)[C@@H](COC(=O)NCc2ccccc2)O[C@H]1n1cnc2c(N[C@@H]3CCOC3)nc(Cl)nc12
InChI Key InChIKey=VLTANQSLGSJYEI-KOZJHOLOSA-N
Data  2 KI
  Tab Delimited (TSV)   2D SDfile   Computed 3D by Vconf -m prep SDfile
Find this compound or compounds like it in BindingDB:
Activity Spreadsheet -- Enzyme Inhibition Constant Data from BindingDB
Found 2 hits for monomerid = 50224782
TargetAdenosine receptor A1(BOVINE)
Universit£
Curated by ChEMBL
LigandPNGBDBM50224782(2-chloro-N6-(R)-3-tetrahydrofuranyl-9H-(2-C-methyl...)
Affinity DataKi:  384nM. Assay description: Displacement of [3H]CCPA from adenosine A1 receptor in bovine cortical membrane
In DepthDetails ArticlePubMed
TargetAdenosine receptor A1(GUINEA PIG)
Universit£
Curated by ChEMBL
LigandPNGBDBM50224782(2-chloro-N6-(R)-3-tetrahydrofuranyl-9H-(2-C-methyl...)
Affinity DataKi:  4.10E+3nM. Assay description: Displacement of [3H]CCPA from adenosine A1 receptor in pig cortical membrane
In DepthDetails ArticlePubMed