BDBM50224908 7-chloro-8-ethylamino-3-oxo-11,16-dioxa-2,4,19,21-tetraaza-tricyclo[15.3.1.0*5,10*]henicosa-1(21),5,7,9,17,19-hexaene-18-carbonitrile::CHEMBL400575
SMILES CCNc1cc2OCCCCOc3nc(NC(=O)Nc2cc1Cl)cnc3C#N
InChI Key InChIKey=CDIBSJOCZFPTPQ-UHFFFAOYSA-N
Data  1 IC50
  Tab Delimited (TSV)   2D SDfile   Computed 3D by Vconf -m prep SDfile
Find this compound or compounds like it in BindingDB:
Activity Spreadsheet -- Enzyme Inhibition Constant Data from BindingDB
Found 1 hit for monomerid = 50224908
TargetSerine/threonine-protein kinase Chk1(Homo sapiens (Human))
Abbott Laboratories
Curated by ChEMBL
LigandPNGBDBM50224908(7-chloro-8-ethylamino-3-oxo-11,16-dioxa-2,4,19,21-...)
Affinity DataIC50:  3nM. Assay description: Inhibition of Chk1
In DepthDetails ArticlePubMed