BDBM50224978 CHEMBL417076
SMILES [H][C@]12CCCN(CCC)C1Cc1c[nH]nc1C2
InChI Key InChIKey=FTSUPYGMFAPCFZ-VUUHIHSGSA-N
Data  9 IC50
  Tab Delimited (TSV)   2D SDfile   Computed 3D by Vconf -m prep SDfile
Find this compound or compounds like it in BindingDB:
Activity Spreadsheet -- Enzyme Inhibition Constant Data from BindingDB
Found 9 hits for monomerid = 50224978
TargetD(1A)/D(1B)/D(2)/D(3)/D(4) dopamine receptor(Rattus norvegicus (rat))
TBA
Curated by ChEMBL
LigandPNGBDBM50224978(CHEMBL417076)
Affinity DataIC50:  1.00E+4nM. Assay description: Inhibition of [3H]-spiperone binding to dopamine receptor of rat corpus striatum
In DepthDetails ArticlePubMed
TargetD(1A)/D(1B)/D(2)/D(3)/D(4) dopamine receptor(Rattus norvegicus (rat))
TBA
Curated by ChEMBL
LigandPNGBDBM50224978(CHEMBL417076)
Affinity DataIC50:  1.00E+4nM. Assay description: Inhibition of [3H]dopamine binding to dopamine receptor of rat corpus striatum
In DepthDetails ArticlePubMed
TargetD(1A)/D(1B)/D(2)/D(3)/D(4) dopamine receptor(Rattus norvegicus (rat))
TBA
Curated by ChEMBL
LigandPNGBDBM50224978(CHEMBL417076)
Affinity DataIC50:  1.00E+4nM. Assay description: Inhibition of [3H]-spiperone binding to dopamine receptor of rat corpus striatum
In DepthDetails ArticlePubMed
TargetD(1A)/D(1B)/D(2)/D(3)/D(4) dopamine receptor(Rattus norvegicus (rat))
TBA
Curated by ChEMBL
LigandPNGBDBM50224978(CHEMBL417076)
Affinity DataIC50:  3.90E+3nM. Assay description: Inhibition of [3H]apomorphine binding to dopamine receptor of rat corpus striatum
In DepthDetails ArticlePubMed
TargetD(1A)/D(1B)/D(2)/D(3)/D(4) dopamine receptor(Rattus norvegicus (rat))
TBA
Curated by ChEMBL
LigandPNGBDBM50224978(CHEMBL417076)
Affinity DataIC50:  1.00E+4nM. Assay description: Inhibition of [3H]-spiperone binding to dopamine receptor of rat corpus striatum
In DepthDetails ArticlePubMed
TargetD(1A)/D(1B)/D(2)/D(3)/D(4) dopamine receptor(Rattus norvegicus (rat))
TBA
Curated by ChEMBL
LigandPNGBDBM50224978(CHEMBL417076)
Affinity DataIC50:  1.00E+4nM. Assay description: Inhibition of [3H]dopamine binding to dopamine receptor of rat corpus striatum
In DepthDetails ArticlePubMed
TargetD(1A)/D(1B)/D(2)/D(3)/D(4) dopamine receptor(Rattus norvegicus (rat))
TBA
Curated by ChEMBL
LigandPNGBDBM50224978(CHEMBL417076)
Affinity DataIC50:  1.00E+4nM. Assay description: Inhibition of [3H]dopamine binding to dopamine receptor of rat corpus striatum
In DepthDetails ArticlePubMed
TargetD(1A)/D(1B)/D(2)/D(3)/D(4) dopamine receptor(Rattus norvegicus (rat))
TBA
Curated by ChEMBL
LigandPNGBDBM50224978(CHEMBL417076)
Affinity DataIC50:  240nM. Assay description: Inhibition of [3H]apomorphine binding to dopamine receptor of rat corpus striatum
In DepthDetails ArticlePubMed
TargetD(1A)/D(1B)/D(2)/D(3)/D(4) dopamine receptor(Rattus norvegicus (rat))
TBA
Curated by ChEMBL
LigandPNGBDBM50224978(CHEMBL417076)
Affinity DataIC50:  3.90E+3nM. Assay description: Inhibition of [3H]apomorphine binding to dopamine receptor of rat corpus striatum
In DepthDetails ArticlePubMed