BDBM50225302 CHEMBL433083
SMILES CN(C)CC1OCc2c1ccc(O)c2O
InChI Key InChIKey=UIMQDIGDCIXDIY-UHFFFAOYSA-N
Data  2 KI
  Tab Delimited (TSV)   2D SDfile   Computed 3D by Vconf -m prep SDfile
Find this compound or compounds like it in BindingDB:
Activity Spreadsheet -- Enzyme Inhibition Constant Data from BindingDB
Found 2 hits for monomerid = 50225302
TargetAlpha-2A/Alpha-2B/Alpha-2C adrenergic receptor(Homo sapiens (Human))
TBA
Curated by ChEMBL
LigandPNGBDBM50225302(CHEMBL433083)
Affinity DataKi:  11nM. Assay description: Binding affinity towards alpha 2 adrenergic receptor
In DepthDetails ArticlePubMed
TargetAlpha-1A/Alpha-1B/Alpha-1D adrenergic receptor(Homo sapiens (Human))
TBA
Curated by ChEMBL
LigandPNGBDBM50225302(CHEMBL433083)
Affinity DataKi:  1.16E+3nM. Assay description: Binding affinity towards alpha 1 adrenergic receptor
In DepthDetails ArticlePubMed