BDBM50225600 1-((3R,4S)-3-(1-(1-((benzylamino)methyl)cyclohexyl)piperazine-4-carbonyl)-4-(4-chlorophenyl)pyrrolidin-1-yl)-2-methylpropan-1-one::CHEMBL251494
SMILES CC(C)C(=O)N1C[C@@H]([C@H](C1)c1ccc(Cl)cc1)C(=O)N1CCN(CC1)C1(CNCc2ccccc2)CCCCC1
InChI Key InChIKey=CMQBDFKEZWLEQI-IHLOFXLRSA-N
Data  1 KI
  Tab Delimited (TSV)   2D SDfile   Computed 3D by Vconf -m prep SDfile
Find this compound or compounds like it in BindingDB:
Activity Spreadsheet -- Enzyme Inhibition Constant Data from BindingDB
Found 1 hit for monomerid = 50225600
TargetMelanocortin receptor 4(Homo sapiens (Human))
Neurocrine Biosciences
Curated by ChEMBL
LigandPNGBDBM50225600(1-((3R,4S)-3-(1-(1-((benzylamino)methyl)cyclohexyl...)
Affinity DataKi:  210nM. Assay description: Displacement of [12]NDPMSH from human MC4R expressed in HEK293 cells
In DepthDetails ArticlePubMed