BDBM50225774 CHEMBL161122
SMILES [H][C@@]1(CNC(=O)c2c(O)c(CC)cc(F)c2OC)CCCN1CC
InChI Key InChIKey=DGJNFKWZDIHOFF-LBPRGKRZSA-N
Data  1 IC50
  Tab Delimited (TSV)   2D SDfile   Computed 3D by Vconf -m prep SDfile
Find this compound or compounds like it in BindingDB:
Activity Spreadsheet -- Enzyme Inhibition Constant Data from BindingDB
Found 1 hit for monomerid = 50225774
TargetD(1A)/D(1B)/D(2)/D(3)/D(4) dopamine receptor(Rattus norvegicus (rat))
TBA
Curated by ChEMBL
LigandPNGBDBM50225774(CHEMBL161122)
Affinity DataIC50:  1.5nM. Assay description: Antidopamine activity in vitro by ability to displace [3H]spiperone from rat brain striatal preparations.
In DepthDetails ArticlePubMed