BDBM50226177 CHEMBL351794
SMILES NC(=O)Cc1ccc(OCC2CCCCC2)cc1
InChI Key InChIKey=YOUYGTFRWKIGMK-UHFFFAOYSA-N
Data  1 KI
  Tab Delimited (TSV)   2D SDfile   Computed 3D by Vconf -m prep SDfile
Find this compound or compounds like it in BindingDB:
Activity Spreadsheet -- Enzyme Inhibition Constant Data from BindingDB
Found 1 hit for monomerid = 50226177
TargetAlcohol dehydrogenase S chain(Equus caballus)
TBA
Curated by ChEMBL
LigandPNGBDBM50226177(CHEMBL351794)
Affinity DataKi:  1.00E+3nM. Assay description: Inhibitory activity against horse liver alcohol dehydrogenase (ADH)
In DepthDetails ArticlePubMed