BDBM50226343 CHEMBL32990
SMILES CC(CO)c1ccc2OCc3ccccc3Oc2c1
InChI Key InChIKey=OUALCKBCQJJGSV-UHFFFAOYSA-N
Data  1 IC50
  Tab Delimited (TSV)   2D SDfile   Computed 3D by Vconf -m prep SDfile
Find this compound or compounds like it in BindingDB:
Activity Spreadsheet -- Enzyme Inhibition Constant Data from BindingDB
Found 1 hit for monomerid = 50226343
TargetProstaglandin G/H synthase 1/2(Ovis aries (Sheep))
TBA
Curated by ChEMBL
LigandPNGBDBM50226343(CHEMBL32990)
Affinity DataIC50:  1.80E+3nM. Assay description: Inhibition of Prostaglandin G/H synthase of ram seminal vesicle microsomes
In DepthDetails ArticlePubMed