BDBM50226344 CHEMBL32218
SMILES CC(=O)Nc1ccc2Oc3cc(CC(O)=O)ccc3OCc2c1
InChI Key InChIKey=QNWGYBCPFHHVLA-UHFFFAOYSA-N
Data  1 IC50
  Tab Delimited (TSV)   2D SDfile   Computed 3D by Vconf -m prep SDfile
Find this compound or compounds like it in BindingDB:
Activity Spreadsheet -- Enzyme Inhibition Constant Data from BindingDB
Found 1 hit for monomerid = 50226344
TargetProstaglandin G/H synthase 1/2(Ovis aries (Sheep))
TBA
Curated by ChEMBL
LigandPNGBDBM50226344(CHEMBL32218)
Affinity DataIC50: >1.00E+5nM. Assay description: Inhibition of Prostaglandin G/H synthase of ram seminal vesicle microsomes
In DepthDetails ArticlePubMed