BDBM50226685 CHEMBL107937
SMILES CN(C1CCCCC1)C(=O)CCCOc1ccc2N=C3NC(=O)[C@@H](CO)N3Cc2c1
InChI Key InChIKey=JQNRKOGJYNZONP-LJQANCHMSA-N
Data  1 IC50
  Tab Delimited (TSV)   2D SDfile   Computed 3D by Vconf -m prep SDfile
Find this compound or compounds like it in BindingDB:
Activity Spreadsheet -- Enzyme Inhibition Constant Data from BindingDB
Found 1 hit for monomerid = 50226685
TargetcGMP-inhibited 3',5'-cyclic phosphodiesterase 3A/3B(Homo sapiens (Human))
TBA
Curated by ChEMBL
LigandPNGBDBM50226685(CHEMBL107937)
Affinity DataIC50:  19nM. Assay description: In vivo inhibition of cyclic AMP phosphodiesterase from human platelets
In DepthDetails ArticlePubMed