BDBM50226774 CHEMBL173217
SMILES CCCc1c(CSCc2ccc(cc2)-c2nn[nH]n2)ccc(C(C)=O)c1O
InChI Key InChIKey=UIEQEUSTJLJAMM-UHFFFAOYSA-N
Data  1 IC50
  Tab Delimited (TSV)   2D SDfile   Computed 3D by Vconf -m prep SDfile
Find this compound or compounds like it in BindingDB:
Activity Spreadsheet -- Enzyme Inhibition Constant Data from BindingDB
Found 1 hit for monomerid = 50226774
TargetCysteinyl leukotriene receptor 1/2(Homo sapiens (Human))
TBA
Curated by ChEMBL
LigandPNGBDBM50226774(CHEMBL173217)
Affinity DataIC50:  316nM. Assay description: Inhibition of LTD4-induced contraction in guinea pig ileum
In DepthDetails ArticlePubMed