BDBM50226780 CHEMBL352513
SMILES CCCc1c(COc2ccc(Cc3nnn[nH]3)cc2)ccc(\C(C)=N/O)c1O
InChI Key InChIKey=AAMKSTAAYLMYJM-QRVIBDJDSA-N
Data  1 IC50
  Tab Delimited (TSV)   2D SDfile   Computed 3D by Vconf -m prep SDfile
Find this compound or compounds like it in BindingDB:
Activity Spreadsheet -- Enzyme Inhibition Constant Data from BindingDB
Found 1 hit for monomerid = 50226780
TargetCysteinyl leukotriene receptor 1/2(Homo sapiens (Human))
TBA
Curated by ChEMBL
LigandPNGBDBM50226780(CHEMBL352513)
Affinity DataIC50:  1.59E+3nM. Assay description: Inhibition of LTD4-induced contraction in guinea pig ileum
In DepthDetails ArticlePubMed